BDBM251608 US9453031, 31
SMILES CNc1nc2ccccc2n1-c1nc2N3CCOCC3CCOc2c(n1)C(C)(C)S(C)(=O)=O
InChI Key InChIKey=MPXUUMJYLCHFAB-UHFFFAOYSA-N
Data  3 IC50
  Tab Delimited (TSV)   2D SDfile   Computed 3D by Vconf -m prep SDfile
Find this compound or compounds like it in BindingDB:
Activity Spreadsheet -- Enzyme Inhibition Constant Data from BindingDB
Found 1 hit for monomerid = 251608
TargetPhosphatidylinositol 3-kinase regulatory subunit alpha/4,5-bisphosphate 3-kinase catalytic subunit alpha isoform(Homo sapiens (Human))
FundacióN Centro Nacional De Investigaciones OncolóGicas Carlos Iii
US Patent
LigandPNGBDBM251608(US9453031, 31)
Affinity DataIC50:  6.50E+3nMpH: 7.5 T: 2°C. Assay description: The kinase activity was measured by using the commercial ADP Hunter Plus assay available from DiscoveRx (#33-016), which is a homogeneous assay to me...
Ligand InfoPC cidPC sid
In DepthDetails US Patent